Wood
narrower: Lignum Aquilae
type: Concept
preferred label: Holz @de
preferred label: Bois @fr
preferred label: Legno @it
preferred label: Hout @nl
preferred label: Lés @sl

smell-source
member: Lignum Aquilae
type: Collection

Lignum Aquilae
type: Concept
in scheme: Olfactory objects
preferred label: Arendshout @nl
preferred label: Agarski les @sl
alternative label: Agarwood @sl
broader: Wood
definition: Tropische houtsoort. Arendshout. Is een vast, hard, zwaer, graeuw, bruin of zwart, en harstachtig hout, dat een' lieflyken … reuk van zich geeft, als men het by 't vuur houd of brand, lemery-v. putten, Wdb. d. Droogeryen 397 b [1743]. @nl

Olfactory objects
type: ConceptScheme