Artefact
type: Concept
narrower: Head cone
preferred label: Artefatto @it
preferred label: Artefakt @sl

artifact
type: Collection
member: Head cone

smell-source
type: Collection
member: Head cone

Head cone
type: Concept
in scheme: Olfactory objects
preferred label: Kegel (parfümiert) @de
preferred label: Cône (parfumé) @fr
preferred label: Cono (profumato) @it
preferred label: Kegel (geparfumeerd) @nl
preferred label: Kadilo v obliki stožca @sl
alternative label: Tannenzapfen @de
alternative label: Zapfen @de
alternative label: Kadilni stožec @sl
broader: Artefact
definition: Cones worn on the head in ancient Egypt made of a mixture of oils, resins and fat (myrrh). fragrance would release due to body heat.

Olfactory objects
type: ConceptScheme