Element
type: Concept
narrower: Ammonia
preferred label: Élément @fr
preferred label: Elemento @it

smell-source
type: Collection
member: Ammonia

Ammonia
type: Concept
in scheme: Olfactory objects
preferred label: Ammoniac @fr
preferred label: Ammoniaca @it
preferred label: Ammoniak @nl
preferred label: Amonijak @sl
alternative label: Amoniak @sl
broader: Element
definition: Ammonia … NHᴅ, is een kleurloos gas, van een zeer prikkelenden reuk, hetwelk rood lakmoespapier blauw kleurt,; De ammoniak is een gas, dat gemakkelijk te herkennen is aan zijnen uitermate prikkelenden, eigendommelijken reuk; Door rotting van organische stoffen (faeces, urine, e.a.) ontstaat ammoniak @nl

Olfactory objects
type: ConceptScheme