Abstract
type: Concept
narrower: Sillage
preferred label: Astratto @it
preferred label: Abstrakten @sl

carrier
type: Collection
member: Sillage

Sillage
type: Concept
in scheme: Olfactory objects
preferred label: Silaža @sl
alternative label: Scent trail
alternative label: Scia @it
broader: Abstract
definition: Invisible olfactory trail like an echo, left by person or object

Olfactory objects
type: ConceptScheme