Fragrant spaces
type: ConceptScheme
has top concept: Runmakerij

Runmakerij
type: Concept
bibliographic citation: WNT: De reuk en smaak (wordt) aangedaan, in de verte zelfs van Kalkovens, Runmakerijen, Leertouwerijen enz., berkhey, N.H. 5, 401 [1805].
definition: Run: Eikenschors (soms ook schors van andere boomen als berken, wilgen), inzonderheid (thans bepaaldelijk) in gemalen toestand, zooals zij, wegens het looizuur dat er in bevat is, in de leerlooierij wordt gebezigd
in scheme: Fragrant spaces
preferred label: Run factory @en
top concept of: Fragrant spaces